Target
Sphingosine 1-phosphate receptor 1
Ligand
BDBM37056
Substrate
Meas. Tech.
Dose Response Assays for S1P1 Agonists and Agonism Potentiators - Potentiator Assay 60K MLSMR
EC50
8551±n/a nM
Citation
 PubChem, PC Dose Response Assays for S1P1 Agonists and Agonism Potentiators - Potentiator Assay 60K MLSMR PubChem Bioassay (2007)[AID] 
Target
Name:
Sphingosine 1-phosphate receptor 1
Synonyms:
CHEDG1 Endothelial differentiation G-protein coupled receptor 1 S1P1 S1PR1_HUMAN Sphingosine 1-phosphate receptor Edg-1
Type:
Enzyme
Mol. Mass.:
42836.02
Organism:
Homo sapiens (Human)
Description:
P21453
Residue:
382
  
Inhibitor
Name:
BDBM37056
Synonyms:
4-butoxy-N-(3-pyridinyl)benzenesulfonamide 4-butoxy-N-pyridin-3-yl-benzenesulfonamide MLS000089992 cid_3239781
Type:
Small organic molecule
Emp. Form.:
C15H18N2O3S
Mol. Mass.:
306.38
SMILES:
CCCCOc1ccc(cc1)S(=O)(=O)Nc1cccnc1
: