Target
Sphingosine 1-phosphate receptor 1
Ligand
BDBM37203
Substrate
Meas. Tech.
Dose Response Assays for S1P1 Agonists and Agonism Potentiators - Potentiator Assay 60K MLSMR
EC50
7033±n/a nM
Citation
 PubChem, PC Dose Response Assays for S1P1 Agonists and Agonism Potentiators - Potentiator Assay 60K MLSMR PubChem Bioassay (2007)[AID] 
Target
Name:
Sphingosine 1-phosphate receptor 1
Synonyms:
CHEDG1 Endothelial differentiation G-protein coupled receptor 1 S1P1 S1PR1_HUMAN Sphingosine 1-phosphate receptor Edg-1
Type:
Enzyme
Mol. Mass.:
42836.02
Organism:
Homo sapiens (Human)
Description:
P21453
Residue:
382
  
Inhibitor
Name:
BDBM37203
Synonyms:
6-(2-methyl-2,3-dihydroindol-1-yl)-7H-purine MLS000101248 cid_5000908
Type:
Small organic molecule
Emp. Form.:
C14H13N5
Mol. Mass.:
251.2865
SMILES:
CC1Cc2ccccc2N1c1ncnc2nc[nH]c12
: