Target
Metabotropic glutamate receptor 2
Ligand
BDBM403445
Substrate
Meas. Tech.
Biological Assays
IC50
326±n/a nM
Citation
 Sebhat, IKArasappan, AHoyt, SBWilkening, RRDeMong, D Chromane, isochromane and dihydroisobenzofuran derivatives as mGluR2—negative allosteric modulators, compositions, and their use US Patent  US10335399 Publication Date 7/2/2019 
Target
Name:
Metabotropic glutamate receptor 2
Synonyms:
GPRC1B GRM2_HUMAN Metabotropic glutamate receptor mGlu2 | metabotropic glutamate 2
Type:
Enzyme
Mol. Mass.:
95584.88
Organism:
Homo sapiens (Human)
Description:
Q14416
Residue:
872
  
Inhibitor
Name:
BDBM403445
Synonyms:
(6S,9R)- or (6R,9S)- 4-(1- (difluoromethyl)- 1H-pyrazol-4-yl)- 6,7,8,9-tetrahydro- 5H-6,9-epoxycyclo- hepta[b]pyridine-2- carboxamide US10806724, Example 1-5B
Type:
Small organic molecule
Emp. Form.:
C15H14F2N4O2
Mol. Mass.:
320.2941
SMILES:
NC(=O)c1cc(-c2cnn(c2)C(F)F)c2C[C@@H]3CC[C@@H](O3)c2n1
: