Target
Sphingosine 1-phosphate receptor 3
Ligand
BDBM37410
Substrate
Meas. Tech.
Dose Response Assay for S1P3 Antagonists
IC50
>49800±n/a nM
Citation
 PubChem, PC Dose Response Assay for S1P3 Antagonists PubChem Bioassay (2007)[AID] 
Target
Name:
Sphingosine 1-phosphate receptor 3
Synonyms:
C9orf108 EDG3 S1P receptor 3 S1P3 S1PR3_HUMAN Sphingosine 1-phosphate receptor 3 (S1P3) | Sphingosine 1-phosphate receptor Edg-3
Type:
G Protein-Coupled Receptor (GPCR)
Mol. Mass.:
42278.13
Organism:
Homo sapiens (Human)
Description:
Q99500
Residue:
378
  
Inhibitor
Name:
BDBM37410
Synonyms:
MLS000092714 N-cyclohexyl-3-(3,4,5-trimethoxyphenyl)-4,5-dihydro-1,2-oxazole-5-carboxamide SMR000028405 | cid_3240617
Type:
Small organic molecule
Emp. Form.:
C19H26N2O5
Mol. Mass.:
362.4201
SMILES:
COc1cc(cc(OC)c1OC)C1=NOC(C1)C(=O)NC1CCCCC1
: