Target
fMet-Leu-Phe receptor
Ligand
BDBM34375
Substrate
Meas. Tech.
Dose Response Assay for Formylpeptide Receptor (FPR) Ligands and Dose Response Counter-Screen Assay for Formylpeptide-Like-1 (FPRL1) Ligands
Ki
>43700±n/a nM
Citation
 PubChem, PC Dose Response Assay for Formylpeptide Receptor (FPR) Ligands and Dose Response Counter-Screen Assay for Formylpeptide-Like-1 (FPRL1) Ligands PubChem Bioassay (2007)[AID] 
Target
Name:
fMet-Leu-Phe receptor
Synonyms:
FPR FPR1_HUMAN N-formyl peptide receptor 1 fMLP receptor formyl peptide receptor 1
Type:
Enzyme Catalytic Domain
Mol. Mass.:
38456.14
Organism:
Homo sapiens (Human)
Description:
gi_4503779
Residue:
350
  
Inhibitor
Name:
BDBM34375
Synonyms:
3-O-ethyl 8-O-methyl 5-oxo-1-sulfanylidene-4H-[1,3]thiazolo[3,4-a]quinazoline-3,8-dicarboxylate 5-keto-1-thioxo-4H-thiazolo[3,4-a]quinazoline-3,8-dicarboxylic acid O3-ethyl ester O8-methyl ester MLS000094734 SMR000030287 | cid_3240606
Type:
Small organic molecule
Emp. Form.:
C15H12N2O5S2
Mol. Mass.:
364.396
SMILES:
CCOC(=O)c1sc(=S)n2c1[nH]c(=O)c1ccc(cc21)C(=O)OC
: