Target
fMet-Leu-Phe receptor
Ligand
BDBM37615
Substrate
Meas. Tech.
Dose Response Assay for Formylpeptide Receptor (FPR) Ligands and Dose Response Counter-Screen Assay for Formylpeptide-Like-1 (FPRL1) Ligands
IC50
21700±n/a nM
Citation
 PubChem, PC Dose Response Assay for Formylpeptide Receptor (FPR) Ligands and Dose Response Counter-Screen Assay for Formylpeptide-Like-1 (FPRL1) Ligands PubChem Bioassay (2007)[AID] 
Target
Name:
fMet-Leu-Phe receptor
Synonyms:
FPR FPR1_HUMAN N-formyl peptide receptor 1 fMLP receptor formyl peptide receptor 1
Type:
Enzyme Catalytic Domain
Mol. Mass.:
38456.14
Organism:
Homo sapiens (Human)
Description:
gi_4503779
Residue:
350
  
Inhibitor
Name:
BDBM37615
Synonyms:
6-Ethyl-2,5-dimethyl-7-oxo-4,7-dihydro-pyrazolo[1,5-a]pyrimidine-3-carbonitrile 6-ethyl-2,5-dimethyl-7-oxo-1H-pyrazolo[1,5-a]pyrimidine-3-carbonitrile MLS000074986 cid_651205
Type:
Small organic molecule
Emp. Form.:
C11H12N4O
Mol. Mass.:
216.2392
SMILES:
CCc1c(C)nc2c(C#N)c(C)[nH]n2c1=O
: