Target
Free fatty acid receptor 4
Ligand
BDBM403687
Substrate
Meas. Tech.
GPR120 pERK AlphaScreen SureFire Assay
EC50
1450±n/a nM
Citation
 Cheng, PTYoon, DS Phenyl-(aza)cycloalkyl carboxylic acid GPR120 modulators US Patent  US10336684 Publication Date 7/2/2019 
Target
Name:
Free fatty acid receptor 4
Synonyms:
FFAR4 G-protein coupled receptor 120 G-protein coupled receptor GT01 GPR120 O3FAR1 PGR4
Type:
PROTEIN
Mol. Mass.:
42256.91
Organism:
Homo sapiens (Human)
Description:
ChEMBL_1508994
Residue:
377
  
Inhibitor
Name:
BDBM403687
Synonyms:
(1S,2S)-2-(4-((1S,3S)-3-Phenoxycyclohexyl)phenethyl)cyclopropanecarboxylic acid (trans-1,3-cyclohexyl enantiomer 1; Absolute Stereochemistry of the Cyclohexyl Moiety is Arbitrarily Drawn) | US10336684, Example 8
Type:
Small organic molecule
Emp. Form.:
C24H28O3
Mol. Mass.:
364.4773
SMILES:
OC(=O)[C@H]1C[C@@H]1CCc1ccc(cc1)[C@H]1CCC[C@H](C1)Oc1ccccc1
: