Target
Free fatty acid receptor 4
Ligand
BDBM403691
Substrate
Meas. Tech.
GPR120 pERK AlphaScreen SureFire Assay
EC50
1030±n/a nM
Citation
 Cheng, PTYoon, DS Phenyl-(aza)cycloalkyl carboxylic acid GPR120 modulators US Patent  US10336684 Publication Date 7/2/2019 
Target
Name:
Free fatty acid receptor 4
Synonyms:
FFAR4 G-protein coupled receptor 120 G-protein coupled receptor GT01 GPR120 O3FAR1 PGR4
Type:
PROTEIN
Mol. Mass.:
42256.91
Organism:
Homo sapiens (Human)
Description:
ChEMBL_1508994
Residue:
377
  
Inhibitor
Name:
BDBM403691
Synonyms:
5-(4-(3-Phenoxycycloheptyl)phenyl)pentanoic acid (diastereomer 1) US10336684, Example 13
Type:
Small organic molecule
Emp. Form.:
C24H30O3
Mol. Mass.:
366.4932
SMILES:
OC(=O)CCCCc1ccc(cc1)C1CCCCC(C1)Oc1ccccc1
: