Target
Free fatty acid receptor 4
Ligand
BDBM403718
Substrate
Meas. Tech.
GPR120 pERK AlphaScreen SureFire Assay
EC50
>32000±n/a nM
Citation
 Cheng, PTYoon, DS Phenyl-(aza)cycloalkyl carboxylic acid GPR120 modulators US Patent  US10336684 Publication Date 7/2/2019 
Target
Name:
Free fatty acid receptor 4
Synonyms:
FFAR4 G-protein coupled receptor 120 G-protein coupled receptor GT01 GPR120 O3FAR1 PGR4
Type:
PROTEIN
Mol. Mass.:
42256.91
Organism:
Homo sapiens (Human)
Description:
ChEMBL_1508994
Residue:
377
  
Inhibitor
Name:
BDBM403718
Synonyms:
US10336684, Example 42
Type:
Small organic molecule
Emp. Form.:
C23H26O4
Mol. Mass.:
366.4501
SMILES:
OC(=O)[C@H]1C[C@@H]1COc1ccc(cc1)[C@@H]1CCC[C@H](C1)Oc1ccccc1
: