Target
N-formyl peptide receptor 2
Ligand
BDBM37607
Substrate
Meas. Tech.
Dose Response Assay for Formylpeptide Receptor-Like-1 (FPRL1) Ligands and Dose Response Counter-Screen Assay for Formylpeptide Receptor (FPR) Ligands
Ki
>40300±n/a nM
Comments
Extracted from aid = 520 and tid = 2
Citation
 PubChem, PC Dose Response Assay for Formylpeptide Receptor-Like-1 (FPRL1) Ligands and Dose Response Counter-Screen Assay for Formylpeptide Receptor (FPR) Ligands PubChem Bioassay (2007)[AID] 
Target
Name:
N-formyl peptide receptor 2
Synonyms:
ALXR, FPRL1, FPR2 FPR2 FPRH1 Formyl Peptide Receptor-Like 1 LXA4 receptor Lipoxin A4 receptor RFP | hFPRL
Type:
G Protein-Coupled Receptor (GPCR)
Mol. Mass.:
38968.35
Organism:
Homo sapiens (Human)
Description:
P25090
Residue:
351
  
Inhibitor
Name:
BDBM37607
Synonyms:
3-(furan-2-carbonyl)-4-hydroxy-1-(2-phenylethyl)-2-pyridin-3-yl-2H-pyrrol-5-one 3-[2-furanyl(oxo)methyl]-4-hydroxy-1-(2-phenylethyl)-2-(3-pyridinyl)-2H-pyrrol-5-one 4-(Furan-2-carbonyl)-3-hydroxy-1-phenethyl-5-pyridin-3-yl-1,5-dihydro-pyrrol-2-one SMR000013496 | cid_646986
Type:
Small organic molecule
Emp. Form.:
C22H18N2O4
Mol. Mass.:
374.3893
SMILES:
O=C(C1C(N(CCc2ccccc2)C(=O)C1=O)c1cccnc1)c1ccco1
: