Target
N-formyl peptide receptor 2
Ligand
BDBM37608
Substrate
Meas. Tech.
Dose Response Assay for Formylpeptide Receptor-Like-1 (FPRL1) Ligands and Dose Response Counter-Screen Assay for Formylpeptide Receptor (FPR) Ligands
Ki
>40300±n/a nM
Comments
Extracted from aid = 520 and tid = 2
Citation
 PubChem, PC Dose Response Assay for Formylpeptide Receptor-Like-1 (FPRL1) Ligands and Dose Response Counter-Screen Assay for Formylpeptide Receptor (FPR) Ligands PubChem Bioassay (2007)[AID] 
Target
Name:
N-formyl peptide receptor 2
Synonyms:
ALXR, FPRL1, FPR2 FPR2 FPRH1 Formyl Peptide Receptor-Like 1 LXA4 receptor Lipoxin A4 receptor RFP | hFPRL
Type:
G Protein-Coupled Receptor (GPCR)
Mol. Mass.:
38968.35
Organism:
Homo sapiens (Human)
Description:
P25090
Residue:
351
  
Inhibitor
Name:
BDBM37608
Synonyms:
3-(furan-2-carbonyl)-4-hydroxy-2-(4-hydroxy-3-methoxyphenyl)-1-(2-phenylethyl)-2H-pyrrol-5-one 3-[2-furanyl(oxo)methyl]-4-hydroxy-2-(4-hydroxy-3-methoxyphenyl)-1-(2-phenylethyl)-2H-pyrrol-5-one 4-(Furan-2-carbonyl)-3-hydroxy-5-(4-hydroxy-3-methoxy-phenyl)-1-phenethyl-1,5-dihydro-pyrrol-2-one SMR000013494 | cid_647552
Type:
Small organic molecule
Emp. Form.:
C24H21NO6
Mol. Mass.:
419.4266
SMILES:
COc1cc(ccc1O)C1C(C(=O)c2ccco2)C(=O)C(=O)N1CCc1ccccc1
: