Target
N-formyl peptide receptor 2
Ligand
BDBM37609
Substrate
Meas. Tech.
Dose Response Assay for Formylpeptide Receptor-Like-1 (FPRL1) Ligands and Dose Response Counter-Screen Assay for Formylpeptide Receptor (FPR) Ligands
Ki
>40300±n/a nM
Comments
Extracted from aid = 520 and tid = 2
Citation
 PubChem, PC Dose Response Assay for Formylpeptide Receptor-Like-1 (FPRL1) Ligands and Dose Response Counter-Screen Assay for Formylpeptide Receptor (FPR) Ligands PubChem Bioassay (2007)[AID] 
Target
Name:
N-formyl peptide receptor 2
Synonyms:
ALXR, FPRL1, FPR2 FPR2 FPRH1 Formyl Peptide Receptor-Like 1 LXA4 receptor Lipoxin A4 receptor RFP | hFPRL
Type:
G Protein-Coupled Receptor (GPCR)
Mol. Mass.:
38968.35
Organism:
Homo sapiens (Human)
Description:
P25090
Residue:
351
  
Inhibitor
Name:
BDBM37609
Synonyms:
MLS000032410 N-(2-methoxyphenyl)-2-[[4-phenyl-5-[(5-phenyl-1,2,3,4-tetrazol-2-yl)methyl]-1,2,4-triazol-3-yl]sulfanyl]ethanamide N-(2-methoxyphenyl)-2-[[4-phenyl-5-[(5-phenyltetrazol-2-yl)methyl]-1,2,4-triazol-3-yl]sulfanyl]acetamide SMR000001626 | cid_647667
Type:
Small organic molecule
Emp. Form.:
C25H22N8O2S
Mol. Mass.:
498.56
SMILES:
COc1ccccc1NC(=O)CSc1nnc(Cn2nnc(n2)-c2ccccc2)n1-c1ccccc1
: