Target
N-formyl peptide receptor 2
Ligand
BDBM37613
Substrate
Meas. Tech.
Dose Response Assay for Formylpeptide Receptor-Like-1 (FPRL1) Ligands and Dose Response Counter-Screen Assay for Formylpeptide Receptor (FPR) Ligands
Ki
>40300±n/a nM
Comments
Extracted from aid = 520 and tid = 2
Citation
 PubChem, PC Dose Response Assay for Formylpeptide Receptor-Like-1 (FPRL1) Ligands and Dose Response Counter-Screen Assay for Formylpeptide Receptor (FPR) Ligands PubChem Bioassay (2007)[AID] 
Target
Name:
N-formyl peptide receptor 2
Synonyms:
ALXR, FPRL1, FPR2 FPR2 FPRH1 Formyl Peptide Receptor-Like 1 LXA4 receptor Lipoxin A4 receptor RFP | hFPRL
Type:
G Protein-Coupled Receptor (GPCR)
Mol. Mass.:
38968.35
Organism:
Homo sapiens (Human)
Description:
P25090
Residue:
351
  
Inhibitor
Name:
BDBM37613
Synonyms:
(4Z)-4-[hydroxy(phenyl)methylene]-1-isobutyl-5-(2-methoxyphenyl)pyrrolidine-2,3-quinone (4Z)-5-(2-methoxyphenyl)-1-(2-methylpropyl)-4-[oxidanyl(phenyl)methylidene]pyrrolidine-2,3-dione MLS000029388 cid_5766180
Type:
Small organic molecule
Emp. Form.:
C22H23NO4
Mol. Mass.:
365.4223
SMILES:
COc1ccccc1C1C(C(=O)c2ccccc2)C(=O)C(=O)N1CC(C)C
: