Target
N-formyl peptide receptor 2
Ligand
BDBM37614
Substrate
Meas. Tech.
Dose Response Assay for Formylpeptide Receptor-Like-1 (FPRL1) Ligands and Dose Response Counter-Screen Assay for Formylpeptide Receptor (FPR) Ligands
Ki
>40300±n/a nM
Comments
Extracted from aid = 520 and tid = 2
Citation
 PubChem, PC Dose Response Assay for Formylpeptide Receptor-Like-1 (FPRL1) Ligands and Dose Response Counter-Screen Assay for Formylpeptide Receptor (FPR) Ligands PubChem Bioassay (2007)[AID] 
Target
Name:
N-formyl peptide receptor 2
Synonyms:
ALXR, FPRL1, FPR2 FPR2 FPRH1 Formyl Peptide Receptor-Like 1 LXA4 receptor Lipoxin A4 receptor RFP | hFPRL
Type:
G Protein-Coupled Receptor (GPCR)
Mol. Mass.:
38968.35
Organism:
Homo sapiens (Human)
Description:
P25090
Residue:
351
  
Inhibitor
Name:
BDBM37614
Synonyms:
(4E)-4-[(2,5-dimethylphenyl)-hydroxy-methylene]-1-(3-imidazol-1-ylpropyl)-5-(4-pyridyl)pyrrolidine-2,3-quinone (4E)-4-[(2,5-dimethylphenyl)-hydroxymethylidene]-1-[3-(1-imidazolyl)propyl]-5-pyridin-4-ylpyrrolidine-2,3-dione 4-(2,5-Dimethyl-benzoyl)-3-hydroxy-1-(3-imidazol-1-yl-propyl)-5-pyridin-4-yl-1,5-dihydro-pyrrol-2-one SMR000013600 | cid_5769015
Type:
Small organic molecule
Emp. Form.:
C24H24N4O3
Mol. Mass.:
416.4724
SMILES:
Cc1ccc(C)c(c1)C(=O)C1C(N(CCCn2ccnc2)C(=O)C1=O)c1ccncc1
: