Target
N-formyl peptide receptor 2
Ligand
BDBM37615
Substrate
Meas. Tech.
Dose Response Assay for Formylpeptide Receptor-Like-1 (FPRL1) Ligands and Dose Response Counter-Screen Assay for Formylpeptide Receptor (FPR) Ligands
Ki
>40300±n/a nM
Comments
Extracted from aid = 520 and tid = 2
Citation
 PubChem, PC Dose Response Assay for Formylpeptide Receptor-Like-1 (FPRL1) Ligands and Dose Response Counter-Screen Assay for Formylpeptide Receptor (FPR) Ligands PubChem Bioassay (2007)[AID] 
Target
Name:
N-formyl peptide receptor 2
Synonyms:
ALXR, FPRL1, FPR2 FPR2 FPRH1 Formyl Peptide Receptor-Like 1 LXA4 receptor Lipoxin A4 receptor RFP | hFPRL
Type:
G Protein-Coupled Receptor (GPCR)
Mol. Mass.:
38968.35
Organism:
Homo sapiens (Human)
Description:
P25090
Residue:
351
  
Inhibitor
Name:
BDBM37615
Synonyms:
6-Ethyl-2,5-dimethyl-7-oxo-4,7-dihydro-pyrazolo[1,5-a]pyrimidine-3-carbonitrile 6-ethyl-2,5-dimethyl-7-oxo-1H-pyrazolo[1,5-a]pyrimidine-3-carbonitrile MLS000074986 cid_651205
Type:
Small organic molecule
Emp. Form.:
C11H12N4O
Mol. Mass.:
216.2392
SMILES:
CCc1c(C)nc2c(C#N)c(C)[nH]n2c1=O
: