Target
N-formyl peptide receptor 2
Ligand
BDBM37617
Substrate
Meas. Tech.
Dose Response Assay for Formylpeptide Receptor-Like-1 (FPRL1) Ligands and Dose Response Counter-Screen Assay for Formylpeptide Receptor (FPR) Ligands
Ki
>40300±n/a nM
Comments
Extracted from aid = 520 and tid = 2
Citation
 PubChem, PC Dose Response Assay for Formylpeptide Receptor-Like-1 (FPRL1) Ligands and Dose Response Counter-Screen Assay for Formylpeptide Receptor (FPR) Ligands PubChem Bioassay (2007)[AID] 
Target
Name:
N-formyl peptide receptor 2
Synonyms:
ALXR, FPRL1, FPR2 FPR2 FPRH1 Formyl Peptide Receptor-Like 1 LXA4 receptor Lipoxin A4 receptor RFP | hFPRL
Type:
G Protein-Coupled Receptor (GPCR)
Mol. Mass.:
38968.35
Organism:
Homo sapiens (Human)
Description:
P25090
Residue:
351
  
Inhibitor
Name:
BDBM37617
Synonyms:
2-(3,4-dimethoxyphenyl)-3-(furan-2-carbonyl)-4-hydroxy-1-(2-phenylethyl)-2H-pyrrol-5-one 2-(3,4-dimethoxyphenyl)-3-[2-furanyl(oxo)methyl]-4-hydroxy-1-(2-phenylethyl)-2H-pyrrol-5-one 5-(3,4-dimethoxyphenyl)-4-(2-furoyl)-3-hydroxy-1-phenethyl-3-pyrrolin-2-one SMR000013493 | cid_652107
Type:
Small organic molecule
Emp. Form.:
C25H23NO6
Mol. Mass.:
433.4532
SMILES:
COc1ccc(cc1OC)C1C(C(=O)c2ccco2)C(=O)C(=O)N1CCc1ccccc1
: