Target
N-formyl peptide receptor 2
Ligand
BDBM37619
Substrate
Meas. Tech.
Dose Response Assay for Formylpeptide Receptor-Like-1 (FPRL1) Ligands and Dose Response Counter-Screen Assay for Formylpeptide Receptor (FPR) Ligands
Ki
>40300±n/a nM
Comments
Extracted from aid = 520 and tid = 2
Citation
 PubChem, PC Dose Response Assay for Formylpeptide Receptor-Like-1 (FPRL1) Ligands and Dose Response Counter-Screen Assay for Formylpeptide Receptor (FPR) Ligands PubChem Bioassay (2007)[AID] 
Target
Name:
N-formyl peptide receptor 2
Synonyms:
ALXR, FPRL1, FPR2 FPR2 FPRH1 Formyl Peptide Receptor-Like 1 LXA4 receptor Lipoxin A4 receptor RFP | hFPRL
Type:
G Protein-Coupled Receptor (GPCR)
Mol. Mass.:
38968.35
Organism:
Homo sapiens (Human)
Description:
P25090
Residue:
351
  
Inhibitor
Name:
BDBM37619
Synonyms:
(4Z)-4-[(3-ethoxyphenyl)-hydroxymethylidene]-1-(2-methoxyethyl)-5-(5-methyl-2-furanyl)pyrrolidine-2,3-dione (4Z)-4-[(3-ethoxyphenyl)-oxidanyl-methylidene]-1-(2-methoxyethyl)-5-(5-methylfuran-2-yl)pyrrolidine-2,3-dione 4-(3-Ethoxy-benzoyl)-3-hydroxy-1-(2-methoxy-ethyl)-5-(5-methyl-furan-2-yl)-1,5-dihydro-pyrrol-2-one SMR000013587 | cid_6398928
Type:
Small organic molecule
Emp. Form.:
C21H23NO6
Mol. Mass.:
385.4104
SMILES:
CCOc1cccc(c1)C(=O)C1C(N(CCOC)C(=O)C1=O)c1ccc(C)o1
: