Target
N-formyl peptide receptor 2
Ligand
BDBM37620
Substrate
Meas. Tech.
Dose Response Assay for Formylpeptide Receptor-Like-1 (FPRL1) Ligands and Dose Response Counter-Screen Assay for Formylpeptide Receptor (FPR) Ligands
Ki
>40300±n/a nM
Comments
Extracted from aid = 520 and tid = 2
Citation
 PubChem, PC Dose Response Assay for Formylpeptide Receptor-Like-1 (FPRL1) Ligands and Dose Response Counter-Screen Assay for Formylpeptide Receptor (FPR) Ligands PubChem Bioassay (2007)[AID] 
Target
Name:
N-formyl peptide receptor 2
Synonyms:
ALXR, FPRL1, FPR2 FPR2 FPRH1 Formyl Peptide Receptor-Like 1 LXA4 receptor Lipoxin A4 receptor RFP | hFPRL
Type:
G Protein-Coupled Receptor (GPCR)
Mol. Mass.:
38968.35
Organism:
Homo sapiens (Human)
Description:
P25090
Residue:
351
  
Inhibitor
Name:
BDBM37620
Synonyms:
(4E)-5-[4-(dimethylamino)phenyl]-1-(2-hydroxypropyl)-4-[hydroxy(p-tolyl)methylene]pyrrolidine-2,3-quinone (4E)-5-[4-(dimethylamino)phenyl]-4-[hydroxy-(4-methylphenyl)methylidene]-1-(2-hydroxypropyl)pyrrolidine-2,3-dione MLS000071839 cid_5903185
Type:
Small organic molecule
Emp. Form.:
C23H26N2O4
Mol. Mass.:
394.4635
SMILES:
CC(O)CN1C(C(C(=O)c2ccc(C)cc2)C(=O)C1=O)c1ccc(cc1)N(C)C
: