Target
N-formyl peptide receptor 2
Ligand
BDBM37624
Substrate
Meas. Tech.
Dose Response Assay for Formylpeptide Receptor-Like-1 (FPRL1) Ligands and Dose Response Counter-Screen Assay for Formylpeptide Receptor (FPR) Ligands
Ki
>40300±n/a nM
Comments
Extracted from aid = 520 and tid = 2
Citation
 PubChem, PC Dose Response Assay for Formylpeptide Receptor-Like-1 (FPRL1) Ligands and Dose Response Counter-Screen Assay for Formylpeptide Receptor (FPR) Ligands PubChem Bioassay (2007)[AID] 
Target
Name:
N-formyl peptide receptor 2
Synonyms:
ALXR, FPRL1, FPR2 FPR2 FPRH1 Formyl Peptide Receptor-Like 1 LXA4 receptor Lipoxin A4 receptor RFP | hFPRL
Type:
G Protein-Coupled Receptor (GPCR)
Mol. Mass.:
38968.35
Organism:
Homo sapiens (Human)
Description:
P25090
Residue:
351
  
Inhibitor
Name:
BDBM37624
Synonyms:
(2-Methyl-7-oxo-3-phenyl-4,7-dihydro-pyrazolo[1,5-a]pyrimidin-5-yl)-acetic acid ethyl ester 2-(7-keto-2-methyl-3-phenyl-1H-pyrazolo[1,5-a]pyrimidin-5-yl)acetic acid ethyl ester SMR000013219 ethyl 2-(2-methyl-7-oxidanylidene-3-phenyl-1H-pyrazolo[1,5-a]pyrimidin-5-yl)ethanoate | ethyl 2-(2-methyl-7-oxo-3-phenyl-1H-pyrazolo[1,5-a]pyrimidin-5-yl)acetate
Type:
Small organic molecule
Emp. Form.:
C17H17N3O3
Mol. Mass.:
311.3352
SMILES:
CCOC(=O)Cc1cc(=O)n2[nH]c(C)c(-c3ccccc3)c2n1
: