Target
N-formyl peptide receptor 2
Ligand
BDBM37633
Substrate
Meas. Tech.
Dose Response Assay for Formylpeptide Receptor-Like-1 (FPRL1) Ligands and Dose Response Counter-Screen Assay for Formylpeptide Receptor (FPR) Ligands
Ki
>40300±n/a nM
Comments
Extracted from aid = 520 and tid = 2
Citation
 PubChem, PC Dose Response Assay for Formylpeptide Receptor-Like-1 (FPRL1) Ligands and Dose Response Counter-Screen Assay for Formylpeptide Receptor (FPR) Ligands PubChem Bioassay (2007)[AID] 
Target
Name:
N-formyl peptide receptor 2
Synonyms:
ALXR, FPRL1, FPR2 FPR2 FPRH1 Formyl Peptide Receptor-Like 1 LXA4 receptor Lipoxin A4 receptor RFP | hFPRL
Type:
G Protein-Coupled Receptor (GPCR)
Mol. Mass.:
38968.35
Organism:
Homo sapiens (Human)
Description:
P25090
Residue:
351
  
Inhibitor
Name:
BDBM37633
Synonyms:
(2S)-2-amino-3-(4-hydroxy-3-iodo-phenyl)propionic acid (2S)-2-azanyl-3-(3-iodanyl-4-oxidanyl-phenyl)propanoic acid 3-Iodo-L-tyrosine (I-Tyr) Monoiodotyrosine cid_439744
Type:
Small organic molecule
Emp. Form.:
C9H10INO3
Mol. Mass.:
307.0851
SMILES:
N[C@@H](Cc1ccc(O)c(I)c1)C(O)=O
: