Target
N-formyl peptide receptor 2
Ligand
BDBM37635
Substrate
Meas. Tech.
Dose Response Assay for Formylpeptide Receptor-Like-1 (FPRL1) Ligands and Dose Response Counter-Screen Assay for Formylpeptide Receptor (FPR) Ligands
Ki
>40300±n/a nM
Comments
Extracted from aid = 520 and tid = 2
Citation
 PubChem, PC Dose Response Assay for Formylpeptide Receptor-Like-1 (FPRL1) Ligands and Dose Response Counter-Screen Assay for Formylpeptide Receptor (FPR) Ligands PubChem Bioassay (2007)[AID] 
Target
Name:
N-formyl peptide receptor 2
Synonyms:
ALXR, FPRL1, FPR2 FPR2 FPRH1 Formyl Peptide Receptor-Like 1 LXA4 receptor Lipoxin A4 receptor RFP | hFPRL
Type:
G Protein-Coupled Receptor (GPCR)
Mol. Mass.:
38968.35
Organism:
Homo sapiens (Human)
Description:
P25090
Residue:
351
  
Inhibitor
Name:
BDBM37635
Synonyms:
MLS000028382 SMR000058604 | cid_657297
Type:
Small organic molecule
Emp. Form.:
C18H24N2O7
Mol. Mass.:
380.3924
SMILES:
[O-][N+]([O-])=O.[H][C@]12CC(C[C@]([H])([C@H]3O[C@@H]13)[N+]2(C)C)OC(=O)[C@H](CO)c1ccccc1
: