Target
N-formyl peptide receptor 2
Ligand
BDBM34375
Substrate
Meas. Tech.
Dose Response Assay for Formylpeptide Receptor-Like-1 (FPRL1) Ligands and Dose Response Counter-Screen Assay for Formylpeptide Receptor (FPR) Ligands
Ki
>40300±n/a nM
Comments
Extracted from aid = 520 and tid = 2
Citation
 PubChem, PC Dose Response Assay for Formylpeptide Receptor-Like-1 (FPRL1) Ligands and Dose Response Counter-Screen Assay for Formylpeptide Receptor (FPR) Ligands PubChem Bioassay (2007)[AID] 
Target
Name:
N-formyl peptide receptor 2
Synonyms:
ALXR, FPRL1, FPR2 FPR2 FPRH1 Formyl Peptide Receptor-Like 1 LXA4 receptor Lipoxin A4 receptor RFP | hFPRL
Type:
G Protein-Coupled Receptor (GPCR)
Mol. Mass.:
38968.35
Organism:
Homo sapiens (Human)
Description:
P25090
Residue:
351
  
Inhibitor
Name:
BDBM34375
Synonyms:
3-O-ethyl 8-O-methyl 5-oxo-1-sulfanylidene-4H-[1,3]thiazolo[3,4-a]quinazoline-3,8-dicarboxylate 5-keto-1-thioxo-4H-thiazolo[3,4-a]quinazoline-3,8-dicarboxylic acid O3-ethyl ester O8-methyl ester MLS000094734 SMR000030287 | cid_3240606
Type:
Small organic molecule
Emp. Form.:
C15H12N2O5S2
Mol. Mass.:
364.396
SMILES:
CCOC(=O)c1sc(=S)n2c1[nH]c(=O)c1ccc(cc21)C(=O)OC
: