Target
N-formyl peptide receptor 2
Ligand
BDBM37752
Substrate
Meas. Tech.
Dose Response Assay for Formylpeptide Receptor-Like-1 (FPRL1) Ligands and Dose Response Counter-Screen Assay for Formylpeptide Receptor (FPR) Ligands
Ki
30100±n/a nM
Comments
Extracted from aid = 520 and tid = 2
Citation
 PubChem, PC Dose Response Assay for Formylpeptide Receptor-Like-1 (FPRL1) Ligands and Dose Response Counter-Screen Assay for Formylpeptide Receptor (FPR) Ligands PubChem Bioassay (2007)[AID] 
Target
Name:
N-formyl peptide receptor 2
Synonyms:
ALXR, FPRL1, FPR2 FPR2 FPRH1 Formyl Peptide Receptor-Like 1 LXA4 receptor Lipoxin A4 receptor RFP | hFPRL
Type:
G Protein-Coupled Receptor (GPCR)
Mol. Mass.:
38968.35
Organism:
Homo sapiens (Human)
Description:
P25090
Residue:
351
  
Inhibitor
Name:
BDBM37752
Synonyms:
MLS000086406 SMR000021908 | cid_3245701
Type:
Small organic molecule
Emp. Form.:
C24H24N4O6
Mol. Mass.:
464.4706
SMILES:
CCOC(=O)N1CCN(CC1)c1cc(NCCC(O)=O)c2C(=O)c3ccccc3-c3onc1c23
: