Target
Dual specificity protein phosphatase 6
Ligand
BDBM34287
Substrate
Meas. Tech.
In vitro MKP-3 Phosphatase Dose Response Active/Probe Assessment Assay - Reproducibility testing
IC50
>50000±n/a nM
Citation
 PubChem, PC In vitro MKP-3 Phosphatase Dose Response Active/Probe Assessment Assay - Reproducibility testing PubChem Bioassay (2007)[AID] 
Target
Name:
Dual specificity protein phosphatase 6
Synonyms:
DUS6_RAT MAP kinase phosphatase 3 Mitogen-activated protein kinase phosphatase 3 | Mkp3
Type:
Enzyme
Mol. Mass.:
42303.19
Organism:
Rattus norvegicus
Description:
gi_16758752
Residue:
381
  
Inhibitor
Name:
BDBM34287
Synonyms:
MLS000082957 cid_665737
Type:
Small organic molecule
Emp. Form.:
C21H23N5O2S3
Mol. Mass.:
473.635
SMILES:
CC(C)Sc1nc2sc3CCCCc3c2c2nnc(SCC(=O)NCc3ccco3)n12
: