Target
Dual specificity protein phosphatase 6
Ligand
BDBM32061
Substrate
Meas. Tech.
In vitro MKP-3 Phosphatase Dose Response Active/Probe Assessment Assay - Reproducibility testing
IC50
3432±n/a nM
Citation
 PubChem, PC In vitro MKP-3 Phosphatase Dose Response Active/Probe Assessment Assay - Reproducibility testing PubChem Bioassay (2007)[AID] 
Target
Name:
Dual specificity protein phosphatase 6
Synonyms:
DUS6_RAT MAP kinase phosphatase 3 Mitogen-activated protein kinase phosphatase 3 | Mkp3
Type:
Enzyme
Mol. Mass.:
42303.19
Organism:
Rattus norvegicus
Description:
gi_16758752
Residue:
381
  
Inhibitor
Name:
BDBM32061
Synonyms:
1,8-bis(azanyl)-3,6-dipyrrolidin-1-yl-2,7-naphthyridine-4-carbonitrile 1,8-diamino-3,6-dipyrrolidin-1-yl-2,7-naphthyridine-4-carbonitrile MLS000054131 cid_2997948
Type:
Small organic molecule
Emp. Form.:
C17H21N7
Mol. Mass.:
323.3955
SMILES:
Nc1nc(cc2c(C#N)c(nc(N)c12)N1CCCC1)N1CCCC1
: