Target
Dual specificity protein phosphatase 6
Ligand
BDBM35418
Substrate
Meas. Tech.
In vitro MKP-3 Phosphatase Dose Response Active/Probe Assessment Assay - Reproducibility testing
IC50
>50000±n/a nM
Citation
 PubChem, PC In vitro MKP-3 Phosphatase Dose Response Active/Probe Assessment Assay - Reproducibility testing PubChem Bioassay (2007)[AID] 
Target
Name:
Dual specificity protein phosphatase 6
Synonyms:
DUS6_RAT MAP kinase phosphatase 3 Mitogen-activated protein kinase phosphatase 3 | Mkp3
Type:
Enzyme
Mol. Mass.:
42303.19
Organism:
Rattus norvegicus
Description:
gi_16758752
Residue:
381
  
Inhibitor
Name:
BDBM35418
Synonyms:
2-({[3-{[(3-methylphenyl)amino]carbonyl}-4-(1-piperidinyl)phenyl]amino}carbonyl)cyclohexanecarboxylic acid 2-[[3-[(3-methylanilino)-oxomethyl]-4-(1-piperidinyl)anilino]-oxomethyl]-1-cyclohexanecarboxylic acid 2-[[3-[(3-methylphenyl)carbamoyl]-4-piperidin-1-ylphenyl]carbamoyl]cyclohexane-1-carboxylic acid SMR000077791 | cid_2960521
Type:
Small organic molecule
Emp. Form.:
C27H33N3O4
Mol. Mass.:
463.5686
SMILES:
Cc1cccc(NC(=O)c2cc(NC(=O)C3CCCCC3C(O)=O)ccc2N2CCCCC2)c1
: