Target
Rho-associated protein kinase 2
Ligand
BDBM37871
Substrate
Meas. Tech.
Dose-response biochemical assay of inhibitors of Rho kinase 2 (Rock2)
IC50
5723±n/a nM
Citation
 PubChem, PC Dose-response biochemical assay of inhibitors of Rho kinase 2 (Rock2)  PubChem Bioassay (2007)[AID] 
Target
Name:
Rho-associated protein kinase 2
Synonyms:
KIAA0619 ROCK2 Rho kinase 2 (ROCKII) Rho-associated protein kinase 2 (ROCK2) Rho-associated protein kinase 2/Transforming protein RhoA Rho-associated, coiled-coil-containing protein kinase II p164 ROCK-2
Type:
Protein
Mol. Mass.:
160885.43
Organism:
Homo sapiens (Human)
Description:
O75116
Residue:
1388
  
Inhibitor
Name:
BDBM37871
Synonyms:
6-Ethyl-thieno[2,3-d]pyrimidin-4-ol CHEMBL6215 SMR000009585 | cid_645569
Type:
Small organic molecule
Emp. Form.:
C8H8N2OS
Mol. Mass.:
180.227
SMILES:
CCc1cc2c(nc[nH]c2=O)s1
: