Target
Rho-associated protein kinase 2
Ligand
BDBM37356
Substrate
Meas. Tech.
Dose-response biochemical assay of inhibitors of Rho kinase 2 (Rock2)
IC50
765±n/a nM
Citation
 PubChem, PC Dose-response biochemical assay of inhibitors of Rho kinase 2 (Rock2)  PubChem Bioassay (2007)[AID] 
Target
Name:
Rho-associated protein kinase 2
Synonyms:
KIAA0619 ROCK2 Rho kinase 2 (ROCKII) Rho-associated protein kinase 2 (ROCK2) Rho-associated protein kinase 2/Transforming protein RhoA Rho-associated, coiled-coil-containing protein kinase II p164 ROCK-2
Type:
Protein
Mol. Mass.:
160885.43
Organism:
Homo sapiens (Human)
Description:
O75116
Residue:
1388
  
Inhibitor
Name:
BDBM37356
Synonyms:
1-Phenyl-2-(5-pyridin-4-yl-4H-[1,2,4]triazol-3-ylsulfanyl)-ethanone 1-phenyl-2-[(5-pyridin-4-yl-1H-1,2,4-triazol-3-yl)thio]ethanone MLS000034666 cid_648322
Type:
Small organic molecule
Emp. Form.:
C15H12N4OS
Mol. Mass.:
296.347
SMILES:
O=C(CSc1nnc([nH]1)-c1ccncc1)c1ccccc1
: