Target
Rho-associated protein kinase 2
Ligand
BDBM37877
Substrate
Meas. Tech.
Dose-response biochemical assay of inhibitors of Rho kinase 2 (Rock2)
IC50
415±n/a nM
Citation
 PubChem, PC Dose-response biochemical assay of inhibitors of Rho kinase 2 (Rock2)  PubChem Bioassay (2007)[AID] 
Target
Name:
Rho-associated protein kinase 2
Synonyms:
KIAA0619 ROCK2 Rho kinase 2 (ROCKII) Rho-associated protein kinase 2 (ROCK2) Rho-associated protein kinase 2/Transforming protein RhoA Rho-associated, coiled-coil-containing protein kinase II p164 ROCK-2
Type:
Protein
Mol. Mass.:
160885.43
Organism:
Homo sapiens (Human)
Description:
O75116
Residue:
1388
  
Inhibitor
Name:
BDBM37877
Synonyms:
MLS000033148 N-[3-[[2-[(4-ethyl-5-pyridin-4-yl-1,2,4-triazol-3-yl)sulfanyl]acetyl]amino]phenyl]thiophene-2-carboxamide N-[3-[[2-[[4-ethyl-5-(4-pyridyl)-1,2,4-triazol-3-yl]thio]acetyl]amino]phenyl]thiophene-2-carboxamide Thiophene-2-carboxylic acid {3-[2-(4-ethyl-5-pyridin-4-yl-4H-[1,2,4]triazol-3-ylsulfanyl)-acetylamino]-phenyl}-amide | cid_653177
Type:
Small organic molecule
Emp. Form.:
C22H20N6O2S2
Mol. Mass.:
464.563
SMILES:
CCn1c(SCC(=O)Nc2cccc(NC(=O)c3cccs3)c2)nnc1-c1ccncc1
: