Target
Rho-associated protein kinase 2
Ligand
BDBM39210
Substrate
Meas. Tech.
Dose-response biochemical assay of inhibitors of Rho kinase 2 (Rock2)
IC50
5815±n/a nM
Citation
 PubChem, PC Dose-response biochemical assay of inhibitors of Rho kinase 2 (Rock2)  PubChem Bioassay (2007)[AID] 
Target
Name:
Rho-associated protein kinase 2
Synonyms:
KIAA0619 ROCK2 Rho kinase 2 (ROCKII) Rho-associated protein kinase 2 (ROCK2) Rho-associated protein kinase 2/Transforming protein RhoA Rho-associated, coiled-coil-containing protein kinase II p164 ROCK-2
Type:
Protein
Mol. Mass.:
160885.43
Organism:
Homo sapiens (Human)
Description:
O75116
Residue:
1388
  
Inhibitor
Name:
BDBM39210
Synonyms:
(7-methylpyrido[2,3]thieno[2,4-d]pyrimidin-4-yl)amine 7-methylpyrido[2,3]thieno[2,4-d]pyrimidin-4-amine SMR000038980 | cid_657967
Type:
Small organic molecule
Emp. Form.:
C10H8N4S
Mol. Mass.:
216.262
SMILES:
Cc1ccc2c(n1)sc1c(N)ncnc21
: