Target
Rho-associated protein kinase 2
Ligand
BDBM37900
Substrate
Meas. Tech.
Dose-response biochemical assay of inhibitors of Rho kinase 2 (Rock2)
IC50
2706±n/a nM
Citation
 PubChem, PC Dose-response biochemical assay of inhibitors of Rho kinase 2 (Rock2)  PubChem Bioassay (2007)[AID] 
Target
Name:
Rho-associated protein kinase 2
Synonyms:
KIAA0619 ROCK2 Rho kinase 2 (ROCKII) Rho-associated protein kinase 2 (ROCK2) Rho-associated protein kinase 2/Transforming protein RhoA Rho-associated, coiled-coil-containing protein kinase II p164 ROCK-2
Type:
Protein
Mol. Mass.:
160885.43
Organism:
Homo sapiens (Human)
Description:
O75116
Residue:
1388
  
Inhibitor
Name:
BDBM37900
Synonyms:
8-(7H-purin-6-yl)-1,4-dioxa-8-azaspiro[4.5]decane SMR000015977 | cid_756696
Type:
Small organic molecule
Emp. Form.:
C12H15N5O2
Mol. Mass.:
261.2798
SMILES:
C1COC2(CCN(CC2)c2ncnc3nc[nH]c23)O1
: