Target
Rho-associated protein kinase 2
Ligand
BDBM37911
Substrate
Meas. Tech.
Dose-response biochemical assay of inhibitors of Rho kinase 2 (Rock2)
IC50
5248±n/a nM
Citation
 PubChem, PC Dose-response biochemical assay of inhibitors of Rho kinase 2 (Rock2)  PubChem Bioassay (2007)[AID] 
Target
Name:
Rho-associated protein kinase 2
Synonyms:
KIAA0619 ROCK2 Rho kinase 2 (ROCKII) Rho-associated protein kinase 2 (ROCK2) Rho-associated protein kinase 2/Transforming protein RhoA Rho-associated, coiled-coil-containing protein kinase II p164 ROCK-2
Type:
Protein
Mol. Mass.:
160885.43
Organism:
Homo sapiens (Human)
Description:
O75116
Residue:
1388
  
Inhibitor
Name:
BDBM37911
Synonyms:
5-methyl-3-phenyl-N-(5-pyridin-4-yl-1,3,4-thiadiazol-2-yl)-1,2-oxazole-4-carboxamide 5-methyl-3-phenyl-N-[5-(4-pyridinyl)-1,3,4-thiadiazol-2-yl]-4-isoxazolecarboxamide MLS000051771 cid_1247272
Type:
Small organic molecule
Emp. Form.:
C18H13N5O2S
Mol. Mass.:
363.393
SMILES:
Cc1onc(c1C(=O)Nc1nnc(s1)-c1ccncc1)-c1ccccc1
: