Target
Rho-associated protein kinase 2
Ligand
BDBM39255
Substrate
Meas. Tech.
Dose-response biochemical assay of inhibitors of Rho kinase 2 (Rock2)
IC50
1994±n/a nM
Citation
 PubChem, PC Dose-response biochemical assay of inhibitors of Rho kinase 2 (Rock2)  PubChem Bioassay (2007)[AID] 
Target
Name:
Rho-associated protein kinase 2
Synonyms:
KIAA0619 ROCK2 Rho kinase 2 (ROCKII) Rho-associated protein kinase 2 (ROCK2) Rho-associated protein kinase 2/Transforming protein RhoA Rho-associated, coiled-coil-containing protein kinase II p164 ROCK-2
Type:
Protein
Mol. Mass.:
160885.43
Organism:
Homo sapiens (Human)
Description:
O75116
Residue:
1388
  
Inhibitor
Name:
BDBM39255
Synonyms:
MLS000063222 N-(2-chlorophenyl)-2-[(5-pyridin-4-yl-1,3,4-oxadiazol-2-yl)sulfanyl]ethanamide N-(2-chlorophenyl)-2-[[5-(4-pyridyl)-1,3,4-oxadiazol-2-yl]thio]acetamide SMR000074776 | cid_851257
Type:
Small organic molecule
Emp. Form.:
C15H11ClN4O2S
Mol. Mass.:
346.791
SMILES:
Clc1ccccc1NC(=O)CSc1nnc(o1)-c1ccncc1
: