Target
Rho-associated protein kinase 2
Ligand
BDBM39263
Substrate
Meas. Tech.
Dose-response biochemical assay of inhibitors of Rho kinase 2 (Rock2)
IC50
80±n/a nM
Citation
 PubChem, PC Dose-response biochemical assay of inhibitors of Rho kinase 2 (Rock2)  PubChem Bioassay (2007)[AID] 
Target
Name:
Rho-associated protein kinase 2
Synonyms:
KIAA0619 ROCK2 Rho kinase 2 (ROCKII) Rho-associated protein kinase 2 (ROCK2) Rho-associated protein kinase 2/Transforming protein RhoA Rho-associated, coiled-coil-containing protein kinase II p164 ROCK-2
Type:
Protein
Mol. Mass.:
160885.43
Organism:
Homo sapiens (Human)
Description:
O75116
Residue:
1388
  
Inhibitor
Name:
BDBM39263
Synonyms:
2,6-bis(fluoranyl)-N-pyridin-4-yl-benzamide 2,6-difluoro-N-4-pyridinylbenzamide MLS000065812 cid_1246120
Type:
Small organic molecule
Emp. Form.:
C12H8F2N2O
Mol. Mass.:
234.2015
SMILES:
Fc1cccc(F)c1C(=O)Nc1ccncc1
: