Target
Rho-associated protein kinase 2
Ligand
BDBM39273
Substrate
Meas. Tech.
Dose-response biochemical assay of inhibitors of Rho kinase 2 (Rock2)
IC50
3799±n/a nM
Citation
 PubChem, PC Dose-response biochemical assay of inhibitors of Rho kinase 2 (Rock2)  PubChem Bioassay (2007)[AID] 
Target
Name:
Rho-associated protein kinase 2
Synonyms:
KIAA0619 ROCK2 Rho kinase 2 (ROCKII) Rho-associated protein kinase 2 (ROCK2) Rho-associated protein kinase 2/Transforming protein RhoA Rho-associated, coiled-coil-containing protein kinase II p164 ROCK-2
Type:
Protein
Mol. Mass.:
160885.43
Organism:
Homo sapiens (Human)
Description:
O75116
Residue:
1388
  
Inhibitor
Name:
BDBM39273
Synonyms:
(phenylmethyl) 2-azanyl-3-cyano-5,7-dihydro-4H-thieno[2,3-c]pyridine-6-carboxylate 2-amino-3-cyano-5,7-dihydro-4H-thieno[2,3-c]pyridine-6-carboxylic acid benzyl ester SMR000078186 benzyl 2-amino-3-cyano-5,7-dihydro-4H-thieno[2,3-c]pyridine-6-carboxylate | cid_948017
Type:
Small organic molecule
Emp. Form.:
C16H15N3O2S
Mol. Mass.:
313.374
SMILES:
Nc1sc2CN(CCc2c1C#N)C(=O)OCc1ccccc1
: