Target
Rho-associated protein kinase 2
Ligand
BDBM37918
Substrate
Meas. Tech.
Dose-response biochemical assay of inhibitors of Rho kinase 2 (Rock2)
IC50
5243±n/a nM
Citation
 PubChem, PC Dose-response biochemical assay of inhibitors of Rho kinase 2 (Rock2)  PubChem Bioassay (2007)[AID] 
Target
Name:
Rho-associated protein kinase 2
Synonyms:
KIAA0619 ROCK2 Rho kinase 2 (ROCKII) Rho-associated protein kinase 2 (ROCK2) Rho-associated protein kinase 2/Transforming protein RhoA Rho-associated, coiled-coil-containing protein kinase II p164 ROCK-2
Type:
Protein
Mol. Mass.:
160885.43
Organism:
Homo sapiens (Human)
Description:
O75116
Residue:
1388
  
Inhibitor
Name:
BDBM37918
Synonyms:
2-furfuryl-[4-(4-pyridyl)thiazol-2-yl]amine N-(2-furanylmethyl)-4-pyridin-4-yl-2-thiazolamine N-(furan-2-ylmethyl)-4-pyridin-4-yl-1,3-thiazol-2-amine cid_2901964
Type:
Small organic molecule
Emp. Form.:
C13H11N3OS
Mol. Mass.:
257.311
SMILES:
C(Nc1nc(cs1)-c1ccncc1)c1ccco1
: