Target
Rho-associated protein kinase 2
Ligand
BDBM37203
Substrate
Meas. Tech.
Dose-response biochemical assay of inhibitors of Rho kinase 2 (Rock2)
IC50
34640±n/a nM
Citation
 PubChem, PC Dose-response biochemical assay of inhibitors of Rho kinase 2 (Rock2)  PubChem Bioassay (2007)[AID] 
Target
Name:
Rho-associated protein kinase 2
Synonyms:
KIAA0619 ROCK2 Rho kinase 2 (ROCKII) Rho-associated protein kinase 2 (ROCK2) Rho-associated protein kinase 2/Transforming protein RhoA Rho-associated, coiled-coil-containing protein kinase II p164 ROCK-2
Type:
Protein
Mol. Mass.:
160885.43
Organism:
Homo sapiens (Human)
Description:
O75116
Residue:
1388
  
Inhibitor
Name:
BDBM37203
Synonyms:
6-(2-methyl-2,3-dihydroindol-1-yl)-7H-purine MLS000101248 cid_5000908
Type:
Small organic molecule
Emp. Form.:
C14H13N5
Mol. Mass.:
251.2865
SMILES:
CC1Cc2ccccc2N1c1ncnc2nc[nH]c12
: