Target
Rho-associated protein kinase 2
Ligand
BDBM39301
Substrate
Meas. Tech.
Dose-response biochemical assay of inhibitors of Rho kinase 2 (Rock2)
IC50
1382±n/a nM
Citation
 PubChem, PC Dose-response biochemical assay of inhibitors of Rho kinase 2 (Rock2)  PubChem Bioassay (2007)[AID] 
Target
Name:
Rho-associated protein kinase 2
Synonyms:
KIAA0619 ROCK2 Rho kinase 2 (ROCKII) Rho-associated protein kinase 2 (ROCK2) Rho-associated protein kinase 2/Transforming protein RhoA Rho-associated, coiled-coil-containing protein kinase II p164 ROCK-2
Type:
Protein
Mol. Mass.:
160885.43
Organism:
Homo sapiens (Human)
Description:
O75116
Residue:
1388
  
Inhibitor
Name:
BDBM39301
Synonyms:
MLS000101231 SMR000017459 dipropyl(7H-purin-6-yl)amine
Type:
Small organic molecule
Emp. Form.:
C11H17N5
Mol. Mass.:
219.2862
SMILES:
CCCN(CCC)c1ncnc2nc[nH]c12
: