Target
Rho-associated protein kinase 2
Ligand
BDBM25470
Substrate
Meas. Tech.
Dose-response biochemical assay of inhibitors of Rho kinase 2 (Rock2)
IC50
<3.03±n/a nM
Citation
 PubChem, PC Dose-response biochemical assay of inhibitors of Rho kinase 2 (Rock2)  PubChem Bioassay (2007)[AID] 
Target
Name:
Rho-associated protein kinase 2
Synonyms:
KIAA0619 ROCK2 Rho kinase 2 (ROCKII) Rho-associated protein kinase 2 (ROCK2) Rho-associated protein kinase 2/Transforming protein RhoA Rho-associated, coiled-coil-containing protein kinase II p164 ROCK-2
Type:
Protein
Mol. Mass.:
160885.43
Organism:
Homo sapiens (Human)
Description:
O75116
Residue:
1388
  
Inhibitor
Name:
BDBM25470
Synonyms:
N-[4-(pyridin-4-yl)-1,3-thiazol-2-yl]-2,3-dihydro-1,4-benzodioxine-2-carboxamide pyridine-thiazole, 1
Type:
Small organic molecule
Emp. Form.:
C17H13N3O3S
Mol. Mass.:
339.368
SMILES:
O=C(Nc1nc(cs1)-c1ccncc1)C1COc2ccccc2O1
: