Target
Rho-associated protein kinase 2
Ligand
BDBM37927
Substrate
Meas. Tech.
Dose-response biochemical assay of inhibitors of Rho kinase 2 (Rock2)
IC50
3325±n/a nM
Citation
 PubChem, PC Dose-response biochemical assay of inhibitors of Rho kinase 2 (Rock2)  PubChem Bioassay (2007)[AID] 
Target
Name:
Rho-associated protein kinase 2
Synonyms:
KIAA0619 ROCK2 Rho kinase 2 (ROCKII) Rho-associated protein kinase 2 (ROCK2) Rho-associated protein kinase 2/Transforming protein RhoA Rho-associated, coiled-coil-containing protein kinase II p164 ROCK-2
Type:
Protein
Mol. Mass.:
160885.43
Organism:
Homo sapiens (Human)
Description:
O75116
Residue:
1388
  
Inhibitor
Name:
BDBM37927
Synonyms:
1-(7H-purin-6-yl)-4-piperidinol MLS000101240 cid_756700
Type:
Small organic molecule
Emp. Form.:
C10H13N5O
Mol. Mass.:
219.2431
SMILES:
OC1CCN(CC1)c1ncnc2nc[nH]c12
: