Target
Rho-associated protein kinase 2
Ligand
BDBM35524
Substrate
Meas. Tech.
Dose-response biochemical assay of inhibitors of Rho kinase 2 (Rock2)
IC50
2371±n/a nM
Citation
 PubChem, PC Dose-response biochemical assay of inhibitors of Rho kinase 2 (Rock2)  PubChem Bioassay (2007)[AID] 
Target
Name:
Rho-associated protein kinase 2
Synonyms:
KIAA0619 ROCK2 Rho kinase 2 (ROCKII) Rho-associated protein kinase 2 (ROCK2) Rho-associated protein kinase 2/Transforming protein RhoA Rho-associated, coiled-coil-containing protein kinase II p164 ROCK-2
Type:
Protein
Mol. Mass.:
160885.43
Organism:
Homo sapiens (Human)
Description:
O75116
Residue:
1388
  
Inhibitor
Name:
BDBM35524
Synonyms:
4-[1-(2-ethenoxyethyl)-2-benzimidazolyl]-1,2,5-oxadiazol-3-amine MLS000109692 [4-[1-(2-vinyloxyethyl)benzimidazol-2-yl]furazan-3-yl]amine | cid_2883004
Type:
Small organic molecule
Emp. Form.:
C13H13N5O2
Mol. Mass.:
271.2746
SMILES:
Nc1nonc1-c1nc2ccccc2n1CCOC=C
: