Target
Genome polyprotein
Ligand
BDBM32755
Substrate
Meas. Tech.
West Nile Virus NS2bNS3 Proteinase Inhibitor Dose Response Confirmation.
IC50
2405±n/a nM
Citation
 PubChem, PC West Nile Virus NS2bNS3 Proteinase Inhibitor Dose Response Confirmation. PubChem Bioassay (2007)[AID] 
Target
Name:
Genome polyprotein
Synonyms:
POLG_WNV | polyprotein precursor
Type:
PROTEIN
Mol. Mass.:
380170.63
Organism:
West Nile virus
Description:
ChEMBL_1438217
Residue:
3430
  
Inhibitor
Name:
BDBM32755
Synonyms:
2-thiophenecarboxylic acid [5-amino-1-(4-methylphenyl)sulfonyl-3-pyrazolyl] ester MLS000033863 Thiophene-2-carboxylic acid 5-amino-1-(toluene-4-sulfonyl)-1H-pyrazol-3-yl ester [5-azanyl-1-(4-methylphenyl)sulfonyl-pyrazol-3-yl] thiophene-2-carboxylate thiophene-2-carboxylic acid (5-amino-1-tosyl-pyrazol-3-yl) ester
Type:
Small organic molecule
Emp. Form.:
C15H13N3O4S2
Mol. Mass.:
363.411
SMILES:
Cc1ccc(cc1)S(=O)(=O)n1nc(OC(=O)c2cccs2)cc1N
: