Target
Genome polyprotein
Ligand
BDBM30767
Substrate
Meas. Tech.
West Nile Virus NS2bNS3 Proteinase Inhibitor Dose Response Confirmation.
IC50
>50000±n/a nM
Citation
 PubChem, PC West Nile Virus NS2bNS3 Proteinase Inhibitor Dose Response Confirmation. PubChem Bioassay (2007)[AID] 
Target
Name:
Genome polyprotein
Synonyms:
POLG_WNV | polyprotein precursor
Type:
PROTEIN
Mol. Mass.:
380170.63
Organism:
West Nile virus
Description:
ChEMBL_1438217
Residue:
3430
  
Inhibitor
Name:
BDBM30767
Synonyms:
3-[[1,3-benzodioxol-5-yl(oxo)methyl]amino]-6-methoxy-1H-indole-2-carboxylic acid methyl ester MLS000081144 cid_662670 methyl 3-(1,3-benzodioxole-5-carbonylamino)-6-methoxy-1H-indole-2-carboxylate
Type:
Small organic molecule
Emp. Form.:
C19H16N2O6
Mol. Mass.:
368.3401
SMILES:
COC(=O)c1[nH]c2cc(OC)ccc2c1NC(=O)c1ccc2OCOc2c1
: