Target
Genome polyprotein
Ligand
BDBM39373
Substrate
Meas. Tech.
West Nile Virus NS2bNS3 Proteinase Inhibitor Dose Response Confirmation.
IC50
>50000±n/a nM
Citation
 PubChem, PC West Nile Virus NS2bNS3 Proteinase Inhibitor Dose Response Confirmation. PubChem Bioassay (2007)[AID] 
Target
Name:
Genome polyprotein
Synonyms:
POLG_WNV | polyprotein precursor
Type:
PROTEIN
Mol. Mass.:
380170.63
Organism:
West Nile virus
Description:
ChEMBL_1438217
Residue:
3430
  
Inhibitor
Name:
BDBM39373
Synonyms:
(2S)-2-(3-butoxypropylcarbamoylamino)-4-methyl-pentanoic acid (2S)-2-(3-butoxypropylcarbamoylamino)-4-methylpentanoic acid MLS000083878 cid_664107
Type:
Small organic molecule
Emp. Form.:
C14H28N2O4
Mol. Mass.:
288.3831
SMILES:
CCCCOCCCNC(=O)N[C@@H](CC(C)C)C(O)=O
: