Target
Genome polyprotein
Ligand
BDBM39374
Substrate
Meas. Tech.
West Nile Virus NS2bNS3 Proteinase Inhibitor Dose Response Confirmation.
IC50
>50000±n/a nM
Citation
 PubChem, PC West Nile Virus NS2bNS3 Proteinase Inhibitor Dose Response Confirmation. PubChem Bioassay (2007)[AID] 
Target
Name:
Genome polyprotein
Synonyms:
POLG_WNV | polyprotein precursor
Type:
PROTEIN
Mol. Mass.:
380170.63
Organism:
West Nile virus
Description:
ChEMBL_1438217
Residue:
3430
  
Inhibitor
Name:
BDBM39374
Synonyms:
5-methyl-2-phenyl-3-pyridazino[4,3-b]indolone 5-methyl-2-phenyl-pyridazino[4,3-b]indol-3-one MLS000077832 cid_664293
Type:
Small organic molecule
Emp. Form.:
C17H13N3O
Mol. Mass.:
275.3046
SMILES:
Cn1c2ccccc2c2nn(-c3ccccc3)c(=O)cc12
: