Target
Genome polyprotein
Ligand
BDBM39376
Substrate
Meas. Tech.
West Nile Virus NS2bNS3 Proteinase Inhibitor Dose Response Confirmation.
IC50
>50000±n/a nM
Citation
 PubChem, PC West Nile Virus NS2bNS3 Proteinase Inhibitor Dose Response Confirmation. PubChem Bioassay (2007)[AID] 
Target
Name:
Genome polyprotein
Synonyms:
POLG_WNV | polyprotein precursor
Type:
PROTEIN
Mol. Mass.:
380170.63
Organism:
West Nile virus
Description:
ChEMBL_1438217
Residue:
3430
  
Inhibitor
Name:
BDBM39376
Synonyms:
4-chloranyl-N-[3-[ethyl-[2-oxidanylidene-2-(propan-2-ylamino)ethyl]amino]-3-oxidanylidene-propyl]benzamide 4-chloro-N-[3-[ethyl-[2-oxo-2-(propan-2-ylamino)ethyl]amino]-3-oxopropyl]benzamide SMR000064715 | cid_2541236
Type:
Small organic molecule
Emp. Form.:
C17H24ClN3O3
Mol. Mass.:
353.844
SMILES:
CCN(CC(=O)NC(C)C)C(=O)CCNC(=O)c1ccc(Cl)cc1
: