Target
Genome polyprotein
Ligand
BDBM39378
Substrate
Meas. Tech.
West Nile Virus NS2bNS3 Proteinase Inhibitor Dose Response Confirmation.
IC50
>50000±n/a nM
Citation
 PubChem, PC West Nile Virus NS2bNS3 Proteinase Inhibitor Dose Response Confirmation. PubChem Bioassay (2007)[AID] 
Target
Name:
Genome polyprotein
Synonyms:
POLG_WNV | polyprotein precursor
Type:
PROTEIN
Mol. Mass.:
380170.63
Organism:
West Nile virus
Description:
ChEMBL_1438217
Residue:
3430
  
Inhibitor
Name:
BDBM39378
Synonyms:
2-(1,3-dioxoisoindol-2-yl)ethyl 2-fluoro-5-morpholin-4-ylsulfonylbenzoate 2-fluoro-5-(4-morpholinylsulfonyl)benzoic acid 2-(1,3-dioxo-2-isoindolyl)ethyl ester MLS000096546 cid_2394619
Type:
Small organic molecule
Emp. Form.:
C21H19FN2O7S
Mol. Mass.:
462.448
SMILES:
Fc1ccc(cc1C(=O)OCCN1C(=O)c2ccccc2C1=O)S(=O)(=O)N1CCOCC1
: