Target
Genome polyprotein
Ligand
BDBM39380
Substrate
Meas. Tech.
West Nile Virus NS2bNS3 Proteinase Inhibitor Dose Response Confirmation.
IC50
>50000±n/a nM
Citation
 PubChem, PC West Nile Virus NS2bNS3 Proteinase Inhibitor Dose Response Confirmation. PubChem Bioassay (2007)[AID] 
Target
Name:
Genome polyprotein
Synonyms:
POLG_WNV | polyprotein precursor
Type:
PROTEIN
Mol. Mass.:
380170.63
Organism:
West Nile virus
Description:
ChEMBL_1438217
Residue:
3430
  
Inhibitor
Name:
BDBM39380
Synonyms:
3-(4-acetylpiperazine-1-carbonyl)-N-(4-methylphenyl)benzenesulfonamide 3-(4-ethanoylpiperazin-1-yl)carbonyl-N-(4-methylphenyl)benzenesulfonamide MLS000081965 cid_2382010
Type:
Small organic molecule
Emp. Form.:
C20H23N3O4S
Mol. Mass.:
401.479
SMILES:
CC(=O)N1CCN(CC1)C(=O)c1cccc(c1)S(=O)(=O)Nc1ccc(C)cc1
: