Target
Genome polyprotein
Ligand
BDBM39382
Substrate
Meas. Tech.
West Nile Virus NS2bNS3 Proteinase Inhibitor Dose Response Confirmation.
IC50
>50000±n/a nM
Citation
 PubChem, PC West Nile Virus NS2bNS3 Proteinase Inhibitor Dose Response Confirmation. PubChem Bioassay (2007)[AID] 
Target
Name:
Genome polyprotein
Synonyms:
POLG_WNV | polyprotein precursor
Type:
PROTEIN
Mol. Mass.:
380170.63
Organism:
West Nile virus
Description:
ChEMBL_1438217
Residue:
3430
  
Inhibitor
Name:
BDBM39382
Synonyms:
8-[(dimethylamino)methyl]-2-methyl-7-oxidanyl-3-quinolin-2-yl-chromen-4-one 8-[(dimethylamino)methyl]-7-hydroxy-2-methyl-3-(2-quinolyl)chromone MLS000055009 cid_5667849
Type:
Small organic molecule
Emp. Form.:
C22H20N2O3
Mol. Mass.:
360.4058
SMILES:
CN(C)Cc1c(O)ccc2c1oc(C)c(-c1ccc3ccccc3n1)c2=O
: