Target
Genome polyprotein
Ligand
BDBM39389
Substrate
Meas. Tech.
West Nile Virus NS2bNS3 Proteinase Inhibitor Dose Response Confirmation.
IC50
>50000±n/a nM
Citation
 PubChem, PC West Nile Virus NS2bNS3 Proteinase Inhibitor Dose Response Confirmation. PubChem Bioassay (2007)[AID] 
Target
Name:
Genome polyprotein
Synonyms:
POLG_WNV | polyprotein precursor
Type:
PROTEIN
Mol. Mass.:
380170.63
Organism:
West Nile virus
Description:
ChEMBL_1438217
Residue:
3430
  
Inhibitor
Name:
BDBM39389
Synonyms:
1-(2,1,3-benzoxadiazol-4-ylsulfonyl)-N-(5-methyl-2-pyridinyl)-4-piperidinecarboxamide 1-benzofurazan-4-ylsulfonyl-N-(5-methyl-2-pyridyl)isonipecotamide SMR000033151 | cid_3236809
Type:
Small organic molecule
Emp. Form.:
C18H19N5O4S
Mol. Mass.:
401.44
SMILES:
Cc1ccc(NC(=O)C2CCN(CC2)S(=O)(=O)c2cccc3nonc23)nc1
: